Reaction Details
TargetNuclear receptor subfamily 1 group I member 2
LigandBDBM50103633
Substrate/Competitorn/a
Meas. Tech.ChEMBL_1487564 (CHEMBL3531531)
EC50 25100±n/a nM
Citation Shukla, SJSakamuru, SHuang, RMoeller, TAShinn, PVanleer, DAuld, DSAustin, CPXia, M Identification of clinically used drugs that activate pregnane X receptors. Drug Metab Dispos39:151-9 (2010) 
 
Nuclear receptor subfamily 1 group I member 2
Name:Nuclear receptor subfamily 1 group I member 2
Type:Nuclear receptor
Mol. Mass.:49774.77
Organism:Homo sapiens (Human)
Description:O75469
Residue:434
BDBM50103633
NameBDBM50103633
Synonyms:EVRA ORTHO EVRA | RWJ-10553
TypeSmall organic molecule
Emp. Form.C21H29NO2
Mol. Mass.327.4605
SMILES[H][C@@]12CC[C@@](O)(C#C)[C@@]1(CC)CC[C@]1([H])[C@@]3([H])CC\C(C=C3CC[C@@]21[H])=N/O