Reaction Details
TargetNuclear receptor subfamily 1 group I member 2
LigandBDBM50103634
Substrate/Competitorn/a
Meas. Tech.ChEMBL_1487565 (CHEMBL3531532)
EC50 1900±n/a nM
Citation Shukla, SJSakamuru, SHuang, RMoeller, TAShinn, PVanleer, DAuld, DSAustin, CPXia, M Identification of clinically used drugs that activate pregnane X receptors. Drug Metab Dispos39:151-9 (2010) 
 
Nuclear receptor subfamily 1 group I member 2
Name:Nuclear receptor subfamily 1 group I member 2
Type:Nuclear receptor
Mol. Mass.:49774.77
Organism:Homo sapiens (Human)
Description:O75469
Residue:434
BDBM50103634
NameBDBM50103634
Synonyms:CL-287389 Nilvadipine SK&F-102362
TypeSmall organic molecule
Emp. Form.C19H19N3O6
Mol. Mass.385.3707
SMILESCOC(=O)C1=C(NC(C)=C(C1c1cccc(c1)[N+]([O-])=O)C(=O)OC(C)C)C#N