Reaction Details
TargetNuclear receptor subfamily 1 group I member 2
LigandBDBM22876
Substrate/Competitorn/a
Meas. Tech.ChEMBL_1487564 (CHEMBL3531531)
EC50 10000±n/a nM
Citation Shukla, SJSakamuru, SHuang, RMoeller, TAShinn, PVanleer, DAuld, DSAustin, CPXia, M Identification of clinically used drugs that activate pregnane X receptors. Drug Metab Dispos39:151-9 (2010) 
 
Nuclear receptor subfamily 1 group I member 2
Name:Nuclear receptor subfamily 1 group I member 2
Type:Nuclear receptor
Mol. Mass.:49774.77
Organism:Homo sapiens (Human)
Description:O75469
Residue:434
BDBM22876
NameBDBM22876
Synonyms:CHEMBL998 Loratadine US9138431, LORATADINE (Claritin) ethyl 4-{13-chloro-4-azatricyclo[9.4.0.0^{3,8}]pentadeca-1(11),3(8),4,6,12,14-hexaen-2-ylidene}piperidine-1-carboxylate
TypeSmall organic molecule
Emp. Form.C22H23ClN2O2
Mol. Mass.382.883
SMILES[#6]-[#6]-[#8]-[#6](=O)-[#7]-1-[#6]-[#6]\[#6](-[#6]-[#6]-1)=[#6]-1\c2ccc(Cl)cc2-[#6]-[#6]-c2cccnc-12