Reaction Details
TargetNuclear receptor subfamily 1 group I member 2
LigandBDBM59083
Substrate/Competitorn/a
Meas. Tech.ChEMBL_1487565 (CHEMBL3531532)
EC50 11200±n/a nM
Citation Shukla, SJSakamuru, SHuang, RMoeller, TAShinn, PVanleer, DAuld, DSAustin, CPXia, M Identification of clinically used drugs that activate pregnane X receptors. Drug Metab Dispos39:151-9 (2010) 
 
Nuclear receptor subfamily 1 group I member 2
Name:Nuclear receptor subfamily 1 group I member 2
Type:Nuclear receptor
Mol. Mass.:49774.77
Organism:Homo sapiens (Human)
Description:O75469
Residue:434
BDBM59083
NameBDBM59083
Synonyms:MLS002154065 THONZONIUM BROMIDE cid_11102
TypeSmall organic molecule
Emp. Form.C32H55N4O
Mol. Mass.511.8048
[N+](C)(C)CCN(Cc1ccc(OC)cc1)c1ncccn1