Reaction Details
TargetNuclear receptor subfamily 1 group I member 2
LigandBDBM50103623
Substrate/Competitorn/a
Meas. Tech.ChEMBL_1487572 (CHEMBL3531878)
EC50 6300±n/a nM
Citation Shukla, SJSakamuru, SHuang, RMoeller, TAShinn, PVanleer, DAuld, DSAustin, CPXia, M Identification of clinically used drugs that activate pregnane X receptors. Drug Metab Dispos39:151-9 (2010) 
 
Nuclear receptor subfamily 1 group I member 2
Name:Nuclear receptor subfamily 1 group I member 2
Type:Nuclear receptor
Mol. Mass.:49774.77
Organism:Homo sapiens (Human)
Description:O75469
Residue:434
BDBM50103623
NameBDBM50103623
Synonyms:L-1633 | Sodium Dibunate
TypeSmall organic molecule
Emp. Form.C18H23NaO3S
Mol. Mass.342.428
SMILES[Na+].CC(C)(C)c1ccc2c(c(ccc2c1)C(C)(C)C)S([O-])(=O)=O