Reaction Details
TargetNuclear receptor subfamily 1 group I member 2
LigandBDBM50194601
Substrate/Competitorn/a
Meas. Tech.ChEMBL_1487572 (CHEMBL3531878)
EC50 10000±n/a nM
Citation Shukla, SJSakamuru, SHuang, RMoeller, TAShinn, PVanleer, DAuld, DSAustin, CPXia, M Identification of clinically used drugs that activate pregnane X receptors. Drug Metab Dispos39:151-9 (2010) 
 
Nuclear receptor subfamily 1 group I member 2
Name:Nuclear receptor subfamily 1 group I member 2
Type:Nuclear receptor
Mol. Mass.:49774.77
Organism:Homo sapiens (Human)
Description:O75469
Residue:434
BDBM50194601
NameBDBM50194601
Synonyms:1,2,4-Trichloro-5-(3-iodo-prop-2-ynyloxy)-benzene CHEMBL1289 Halotex | M-1028
TypeSmall organic molecule
Emp. Form.C9H4Cl3IO
Mol. Mass.361.391
SMILESClc1cc(Cl)c(OCC#CI)cc1Cl