Reaction Details
TargetUDP-glucuronosyltransferase 1A1
LigandBDBM50088502
Substrate/Competitorn/a
Meas. Tech.ChEMBL_1489277 (CHEMBL3533120)
Ki 14100±n/a nM
Citation Maul, RSiegl, DKulling, SE Glucuronidation of the red clover isoflavone irilone by liver microsomes from different species and human UDP-glucuronosyltransferases. Drug Metab Dispos39:610-6 (2011) 
 
UDP-glucuronosyltransferase 1A1
Name:UDP-glucuronosyltransferase 1A1
Type:Enzyme
Mol. Mass.:59604.34
Organism:Homo sapiens (Human)
Description:P22309
Residue:533
BDBM50088502
NameBDBM50088502
Synonyms:CHEBI:5970 | CHEMBL3527329
TypeSmall organic molecule
Emp. Form.C16H10O6
Mol. Mass.298.247
SMILESOc1ccc(cc1)-c1coc2cc3OCOc3c(O)c2c1=O