Reaction Details
TargetCannabinoid receptor 1
LigandBDBM50172904
Substrate/Competitorn/a
Meas. Tech.ChEMBL_1487651 (CHEMBL3532637)
Ki 231±n/a nM
Citation Wittgen, HGvan den Heuvel, JJvan den Broek, PHDinter-Heidorn, HKoenderink, JBRussel, FG Cannabinoid type 1 receptor antagonists modulate transport activity of multidrug resistance-associated proteins MRP1, MRP2, MRP3, and MRP4. Drug Metab Dispos39:1294-302 (2011) 
 
Cannabinoid receptor 1
Name:Cannabinoid receptor 1
Type:G Protein-Coupled Receptor (GPCR)
Mol. Mass.:52868.96
Organism:Homo sapiens (Human)
Description:P21554
Residue:472
BDBM50172904
NameBDBM50172904
Synonyms:3,4-diarylpyrazoline derivative | CHEMBL196989
TypeSmall organic molecule
Emp. Form.C21H24ClN5O2S
Mol. Mass.445.966
SMILESCN=C(NS(=O)(=O)N1CCCC1)N1CC(C(=N1)c1ccc(Cl)cc1)c1ccccc1