Reaction Details
TargetCytochrome P450 3A4
LigandBDBM50361983
Substrate/Competitorn/a
Meas. Tech.ChEMBL_1492495 (CHEMBL3528870)
Ki 1900±n/a nM
Citation Henne, KRTran, TBVandenBrink, BMRock, DAAidasani, DKSubramanian, RMason, AKStresser, DMTeffera, YWong, SGJohnson, MGChen, XTonn, GRWong, BK Sequential metabolism of AMG 487, a novel CXCR3 antagonist, results in formation of quinone reactive metabolites that covalently modify CYP3A4 Cys239 and cause time-dependent inhibition of the enzyme. Drug Metab Dispos40:1429-40 (2012) 
 
Cytochrome P450 3A4
Name:Cytochrome P450 3A4
Type:Enzyme
Mol. Mass.:57349.57
Organism:Homo sapiens (Human)
Description:n/a
Residue:503
BDBM50361983
NameBDBM50361983
Synonyms:CHEMBL1939697
TypeSmall organic molecule
Emp. Form.C30H24F3N5O4
Mol. Mass.575.5379
SMILESC[C@@H](N(Cc1cccnc1)C(=O)Cc1ccc(OC(F)(F)F)cc1)c1nc2ncccc2c(=O)n1-c1ccc(O)cc1