Reaction Details
TargetCytochrome P450 3A4
LigandBDBM50211114
Substrate/Competitorn/a
Meas. Tech.ChEMBL_1488502 (CHEMBL3536344)
IC50 7000±n/a nM
Citation Henne, KRTran, TBVandenBrink, BMRock, DAAidasani, DKSubramanian, RMason, AKStresser, DMTeffera, YWong, SGJohnson, MGChen, XTonn, GRWong, BK Sequential metabolism of AMG 487, a novel CXCR3 antagonist, results in formation of quinone reactive metabolites that covalently modify CYP3A4 Cys239 and cause time-dependent inhibition of the enzyme. Drug Metab Dispos40:1429-40 (2012) 
 
Cytochrome P450 3A4
Name:Cytochrome P450 3A4
Type:Enzyme
Mol. Mass.:57349.57
Organism:Homo sapiens (Human)
Description:n/a
Residue:503
BDBM50211114
NameBDBM50211114
Synonyms:(-)-(R)-N-(1-(3-(4-ethoxyphenyl)-4-oxo-3,4-dihydropyrido[2,3-d]pyrimidin-2-yl)ethyl)-N-(pyridin-3-ylmethyl)-2-(4-(trifluoromethoxy)phenyl)acetamide AMG-487 | CHEMBL397983
TypeSmall organic molecule
Emp. Form.C32H28F3N5O4
Mol. Mass.603.591
SMILESCCOc1ccc(cc1)-n1c(nc2ncccc2c1=O)[C@@H](C)N(Cc1cccnc1)C(=O)Cc1ccc(OC(F)(F)F)cc1