Reaction Details
TargetSolute carrier organic anion transporter family member 1B1
LigandBDBM50012957
Substrate/Competitorn/a
Meas. Tech.ChEMBL_1487740 (CHEMBL3533391)
IC50 2200±n/a nM
Citation Soars, MGBarton, PIsmair, MJupp, RRiley, RJ The development, characterization, and application of an OATP1B1 inhibition assay in drug discovery. Drug Metab Dispos40:1641-8 (2012) 
 
Solute carrier organic anion transporter family member 1B1
Name:Solute carrier organic anion transporter family member 1B1
Type:Protein
Mol. Mass.:76468.06
Organism:Homo sapiens (Human)
Description:Q9Y6L6
Residue:691
BDBM50012957
NameBDBM50012957
Synonyms:1-((p-(2-(5-chloro-o-anisamido)ethyl)phenyl)sulfonyl)-3-cyclohexylurea 5-chloro-N-(2-(4-((((cyclohexylamino)carbonyl)amino)sulfonyl)phenyl)ethyl)-2-methoxybenzamide CHEMBL472 Glibenclamide | US20230348371, Compound 5
TypeSmall organic molecule
Emp. Form.C23H28ClN3O5S
Mol. Mass.494.004
SMILESCOc1ccc(Cl)cc1C(=O)NCCc1ccc(cc1)S(=O)(=O)NC(=O)NC1CCCCC1