Reaction Details
TargetSolute carrier organic anion transporter family member 1B1
LigandBDBM50110590
Substrate/Competitorn/a
Meas. Tech.ChEMBL_1487742 (CHEMBL3533736)
IC50 130000±n/a nM
Citation Soars, MGBarton, PIsmair, MJupp, RRiley, RJ The development, characterization, and application of an OATP1B1 inhibition assay in drug discovery. Drug Metab Dispos40:1641-8 (2012) 
 
Solute carrier organic anion transporter family member 1B1
Name:Solute carrier organic anion transporter family member 1B1
Type:Protein
Mol. Mass.:76468.06
Organism:Homo sapiens (Human)
Description:Q9Y6L6
Residue:691
BDBM50110590
NameBDBM50110590
Synonyms:2,2-Dimethyl-5-(2,5-dimethylphenoxy)valeriansaeure 2,2-Dimethyl-5-(2,5-xylyloxy)valeric acid CHEMBL457 | GEMFIBROZIL
TypeSmall organic molecule
Emp. Form.C15H22O3
Mol. Mass.250.3334
SMILESCc1ccc(C)c(OCCCC(C)(C)C(O)=O)c1