Reaction Details
TargetPOU domain, class 2, transcription factor 2
LigandBDBM50228403
Substrate/Competitorn/a
Meas. Tech.ChEMBL_1491733 (CHEMBL3536925)
IC50 80000±n/a nM
Citation Ishiguro, NShimizu, HKishimoto, WEbner, TSchaefer, O Evaluation and prediction of potential drug-drug interactions of linagliptin using in vitro cell culture methods. Drug Metab Dispos41:149-58 (2012) 
 
POU domain, class 2, transcription factor 2
Name:POU domain, class 2, transcription factor 2
Type:PROTEIN
Mol. Mass.:51217.88
Organism:Homo sapiens (Human)
Description:ChEMBL_109671
Residue:479
BDBM50228403
NameBDBM50228403
Synonyms:(R)-8-(3-aminopiperidin-1-yl)-7-(but-2-ynyl)-3-methyl-1-((4-methylquinazolin-2-yl)methyl)-1H-purine-2,6(3H,7H)-dione CHEMBL237500 US10202383, Example 2(142) US9255098, Linagliptin US9556175, 2(142)
TypeSmall organic molecule
Emp. Form.C25H28N8O2
Mol. Mass.472.5422
SMILESCC#CCn1c(nc2n(C)c(=O)n(Cc3nc(C)c4ccccc4n3)c(=O)c12)N1CCC[C@@H](N)C1