Reaction Details
TargetSulfotransferase 1A1
LigandBDBM50187243
Substrate/Competitorn/a
Meas. Tech.ChEMBL_1484211 (CHEMBL3537872)
Kd 4.3±n/a nM
Citation Rohn, KJCook, ITLeyh, TSKadlubar, SAFalany, CN Potent inhibition of human sulfotransferase 1A1 by 17a-ethinylestradiol: role of 3'-phosphoadenosine 5'-phosphosulfate binding and structural rearrangements in regulating inhibition and activity. Drug Metab Dispos40:1588-95 (2012) 
 
Sulfotransferase 1A1
Name:Sulfotransferase 1A1
Type:Enzyme
Mol. Mass.:34165.45
Organism:Homo sapiens (Human)
Description:P50225
Residue:295
BDBM50187243
NameBDBM50187243
Synonyms:17-ethinyl-3,17-estradiol 17-ethinylestradiol 17alpha-ethynylestra-1,3,5(10)-triene-3,17beta-diol CHEMBL691 Ethinylestradiol ethinyloestradiol
TypeSmall organic molecule
Emp. Form.C20H24O2
Mol. Mass.296.4034
SMILESC[C@]12CC[C@H]3[C@@H](CCc4cc(O)ccc34)[C@@H]1CC[C@@]2(O)C#C