Reaction Details
TargetSolute carrier family 15 member 1
LigandBDBM50088510
Substrate/Competitorn/a
Meas. Tech.ChEMBL_1483465 (CHEMBL3541001)
Kd 2.2±n/a nM
Citation Hu, YChen, XSmith, DE Species-dependent uptake of glycylsarcosine but not oseltamivir in Pichia pastoris expressing the rat, mouse, and human intestinal peptide transporter PEPT1. Drug Metab Dispos40:1328-35 (2012) 
 
Solute carrier family 15 member 1
Name:Solute carrier family 15 member 1
Type:PROTEIN
Mol. Mass.:78568.93
Organism:Mus musculus
Description:ChEMBL_104655
Residue:709
BDBM50088510
NameBDBM50088510
Synonyms:CHEMBL3526259
TypeSmall organic molecule
Emp. Form.C6H11NO3
Mol. Mass.145.1564
SMILESCCC(=O)N(C)CC(O)=O