Reaction Details
TargetUDP-glucuronosyltransferase 2B7
LigandBDBM19264
Substrate/Competitorn/a
Meas. Tech.ChEMBL_1481182 (CHEMBL3538041)
Ki 1500±n/a nM
Citation Dostalek, MCourt, MHHazarika, SAkhlaghi, F Diabetes mellitus reduces activity of human UDP-glucuronosyltransferase 2B7 in liver and kidney leading to decreased formation of mycophenolic acid acyl-glucuronide metabolite. Drug Metab Dispos39:448-55 (2011) 
 
UDP-glucuronosyltransferase 2B7
Name:UDP-glucuronosyltransferase 2B7
Type:Enzyme
Mol. Mass.:60705.98
Organism:Homo sapiens (Human)
Description:P16662
Residue:529
BDBM19264
NameBDBM19264
Synonyms:(4E)-6-(4-hydroxy-6-methoxy-7-methyl-3-oxo-1,3-dihydro-2-benzofuran-5-yl)-4-methylhex-4-enoic acid CHEMBL866 Mycophenolic Acid (MPA) | Myfortic
TypeSmall organic molecule
Emp. Form.C17H20O6
Mol. Mass.320.3371
SMILESCOc1c(C)c2COC(=O)c2c(O)c1C\C=C(/C)CCC(O)=O