Reaction Details
TargetATP-dependent translocase ABCB1
LigandBDBM50088575
Substrate/Competitorn/a
Meas. Tech.ChEMBL_1496424 (CHEMBL3580314)
Ki 610±n/a nM
Citation Callies, OSánchez-Cañete, MPGamarro, FJiménez, IACastanys, SBazzocchi, IL Restoration of Chemosensitivity in P-Glycoprotein-Dependent Multidrug-Resistant Cells by Dihydro-ß-agarofuran Sesquiterpenes from Celastrus vulcanicola. J Nat Prod78:736-45 (2015) 
 
ATP-dependent translocase ABCB1
Name:ATP-dependent translocase ABCB1
Type:Protein
Mol. Mass.:141503.50
Organism:Homo sapiens (Human)
Description:P08183
Residue:1280
BDBM50088575
NameBDBM50088575
Synonyms:CHEMBL3577217
TypeSmall organic molecule
Emp. Form.C35H40O10
Mol. Mass.620.6861
SMILES[H][C@@]12[C@@H](OC(C)=O)[C@]3(OC1(C)C)[C@@](C)(O)CC[C@H](OC(C)=O)[C@@]3(C)[C@@H](OC(=O)c1ccccc1)[C@H]2OC(=O)\C=C/c1ccccc1