Reaction Details
TargetHypoxanthine-guanine phosphoribosyltransferase
LigandBDBM50089443
Substrate/Competitorn/a
Meas. Tech.ChEMBL_1496953 (CHEMBL3579427)
Ki 4000±n/a nM
Citation Eng, WSHocková, D?pacek, PJaneba, ZWest, NPWoods, KNaesens, LMKeough, DTGuddat, LW First Crystal Structures of Mycobacterium tuberculosis 6-Oxopurine Phosphoribosyltransferase: Complexes with GMP and Pyrophosphate and with Acyclic Nucleoside Phosphonates Whose Prodrugs Have Antituberculosis Activity. J Med Chem58:4822-38 (2015) 
 
Hypoxanthine-guanine phosphoribosyltransferase
Name:Hypoxanthine-guanine phosphoribosyltransferase
Type:Protein
Mol. Mass.:24579.61
Organism:Homo sapiens (Human)
Description:P00492
Residue:218
BDBM50089443
NameBDBM50089443
Synonyms:CHEMBL3578109
TypeSmall organic molecule
Emp. Form.C12H20N4O9P2
Mol. Mass.426.2561
SMILESOP(O)(=O)CCOCC(Cn1cnc2c1nc[nH]c2=O)OCCP(O)(O)=O