Reaction Details
TargetGlucocorticoid receptor
LigandBDBM50091049
Substrate/Competitorn/a
Meas. Tech.ChEMBL_1499884 (CHEMBL3583216)
Ki 35±n/a nM
Citation Eda, MKuroda, TKaneko, SAoki, YYamashita, MOkumura, CIkeda, YOhbora, TSakaue, MKoyama, NAritomo, K Synthesis and Biological Evaluation of Cyclopentaquinoline Derivatives as Nonsteroidal Glucocorticoid Receptor Antagonists. J Med Chem58:4918-26 (2015) 
 
Glucocorticoid receptor
Name:Glucocorticoid receptor
Type:Enzyme
Mol. Mass.:85656.87
Organism:Homo sapiens (Human)
Description:P04150
Residue:777
BDBM50091049
NameBDBM50091049
Synonyms:CHEMBL3582125
TypeSmall organic molecule
Emp. Form.C24H25N3O
Mol. Mass.371.4748
SMILESCC1(C)Nc2c3CCCc3c(cc2C(C)(C)C1=O)-c1ccnc2ncccc12