Reaction Details
TargetGlucocorticoid receptor
LigandBDBM50091044
Substrate/Competitorn/a
Meas. Tech.ChEMBL_1499884 (CHEMBL3583216)
Ki 55±n/a nM
Citation Eda, MKuroda, TKaneko, SAoki, YYamashita, MOkumura, CIkeda, YOhbora, TSakaue, MKoyama, NAritomo, K Synthesis and Biological Evaluation of Cyclopentaquinoline Derivatives as Nonsteroidal Glucocorticoid Receptor Antagonists. J Med Chem58:4918-26 (2015) 
 
Glucocorticoid receptor
Name:Glucocorticoid receptor
Type:Enzyme
Mol. Mass.:85656.87
Organism:Homo sapiens (Human)
Description:P04150
Residue:777
BDBM50091044
NameBDBM50091044
Synonyms:CHEMBL3582114
TypeSmall organic molecule
Emp. Form.C19H22N2O4
Mol. Mass.342.389
SMILESCc1noc(C)c1-c1cc2c(NC(C)(C)C(=O)C2(C)C)c2OCOc12