Reaction Details
TargetGlucocorticoid receptor
LigandBDBM50091046
Substrate/Competitorn/a
Meas. Tech.ChEMBL_1499884 (CHEMBL3583216)
Ki 15±n/a nM
Citation Eda, MKuroda, TKaneko, SAoki, YYamashita, MOkumura, CIkeda, YOhbora, TSakaue, MKoyama, NAritomo, K Synthesis and Biological Evaluation of Cyclopentaquinoline Derivatives as Nonsteroidal Glucocorticoid Receptor Antagonists. J Med Chem58:4918-26 (2015) 
 
Glucocorticoid receptor
Name:Glucocorticoid receptor
Type:Enzyme
Mol. Mass.:85656.87
Organism:Homo sapiens (Human)
Description:P04150
Residue:777
BDBM50091046
NameBDBM50091046
Synonyms:CHEMBL3582112
TypeSmall organic molecule
Emp. Form.C21H26N2O2
Mol. Mass.338.4433
SMILESCc1noc(C)c1-c1cc2c(NC(C)(C)C(=O)C2(C)C)c2CCCc12