Reaction Details
TargetNischarin
LigandBDBM50091338
Substrate/Competitorn/a
Meas. Tech.ChEMBL_1497761 (CHEMBL3583020)
Ki 23±n/a nM
Citation Del Bello, FBargelli, VCifani, CGratteri, PBazzicalupi, CDiamanti, EGiannella, MMammoli, VMatucci, RMicioni Di Bonaventura, MVPiergentili, AQuaglia, WPigini, M Antagonism/Agonism modulation to build novel antihypertensives selectively triggering i1-imidazoline receptor activation. ACS Med Chem Lett6:496-501 (2015) 
 
Nischarin
Name:Nischarin
Type:Enzyme Catalytic Domain
Mol. Mass.:166460.59
Organism:RAT
Description:Q4G017
Residue:1502
BDBM50091338
NameBDBM50091338
Synonyms:CHEMBL3582264
TypeSmall organic molecule
Emp. Form.C13H18N2
Mol. Mass.202.2954
SMILESCC(Cc1ccccc1C)C1=NCCN1