Reaction Details
TargetCarbonic anhydrase 2
LigandBDBM50091688
Substrate/Competitorn/a
Meas. Tech.ChEMBL_1498375 (CHEMBL3584204)
Ki 2.6±n/a nM
Citation Shi, QKaiser, TMDentmon, ZWCeruso, MVullo, DSupuran, CTSnyder, JP Design and Validation of FRESH, a Drug Discovery Paradigm Resting on Robust Chemical Synthesis. ACS Med Chem Lett6:518-22 (2015) 
 
Carbonic anhydrase 2
Name:Carbonic anhydrase 2
Type:Enzyme
Mol. Mass.:29250.71
Organism:Homo sapiens (Human)
Description:P00918
Residue:260
BDBM50091688
NameBDBM50091688
Synonyms:CHEMBL3582345
TypeSmall organic molecule
Emp. Form.C17H15N3O3S
Mol. Mass.341.384
SMILESNS(=O)(=O)c1ccc(NC(=O)Nc2ccc3ccccc3c2)cc1