Reaction Details
TargetMonocarboxylate transporter 1
LigandBDBM50092065
Substrate/Competitorn/a
Meas. Tech.ChEMBL_1498543 (CHEMBL3584796)
IC50 25±n/a nM
Citation Gurrapu, SJonnalagadda, SKAlam, MANelson, GLSneve, MGDrewes, LRMereddy, VR Monocarboxylate transporter 1 inhibitors as potential anticancer agents. ACS Med Chem Lett6:558-61 (2015) 
 
Monocarboxylate transporter 1
Name:Monocarboxylate transporter 1
Type:Enzyme
Mol. Mass.:53245.17
Organism:Rattus norvegicus (Rat)
Description:P53987
Residue:494
BDBM50092065
NameBDBM50092065
Synonyms:CHEMBL3582426
TypeSmall organic molecule
Emp. Form.C16H17N2NaO3
Mol. Mass.308.3075
SMILES[Na+].COc1cc(ccc1\C=C(/C#N)C([O-])=O)N1CCCCC1