Reaction Details
TargetMonocarboxylate transporter 1
LigandBDBM50092072
Substrate/Competitorn/a
Meas. Tech.ChEMBL_1498543 (CHEMBL3584796)
IC50 9.0±n/a nM
Citation Gurrapu, SJonnalagadda, SKAlam, MANelson, GLSneve, MGDrewes, LRMereddy, VR Monocarboxylate transporter 1 inhibitors as potential anticancer agents. ACS Med Chem Lett6:558-61 (2015) 
 
Monocarboxylate transporter 1
Name:Monocarboxylate transporter 1
Type:Enzyme
Mol. Mass.:53245.17
Organism:Rattus norvegicus (Rat)
Description:P53987
Residue:494
BDBM50092072
NameBDBM50092072
Synonyms:CHEMBL3582419 | US9296728, 14
TypeSmall organic molecule
Emp. Form.C19H26N2O3
Mol. Mass.330.4213
SMILESCCCCN(CCCC)c1ccc(\C=C(/C#N)C(O)=O)c(OC)c1