Reaction Details
TargetCREB-binding protein
LigandBDBM50380682
Substrate/Competitorn/a
Meas. Tech.ChEMBL_1498193 (CHEMBL3583517)
Kd 3084±n/a nM
Citation Ran, XZhao, YLiu, LBai, LYang, CYZhou, BMeagher, JLChinnaswamy, KStuckey, JAWang, S Structure-Based Design of¿-Carboline Analogues as Potent and Specific BET Bromodomain Inhibitors. J Med Chem58:4927-39 (2015) 
 
CREB-binding protein
Name:CREB-binding protein
Type:Transcription Coactivator
Mol. Mass.:265411.66
Organism:Homo sapiens (Human)
Description:Q92793
Residue:2442
BDBM50380682
NameBDBM50380682
Synonyms:CHEMBL2017291 | I-BET151 (16)
TypeSmall organic molecule
Emp. Form.C23H21N5O3
Mol. Mass.415.4445
SMILESCOc1cc2c3n([C@H](C)c4ccccn4)c(=O)[nH]c3cnc2cc1-c1c(C)noc1C