Reaction Details
TargetBromodomain-containing protein 3
LigandBDBM50092312
Substrate/Competitorn/a
Meas. Tech.ChEMBL_1498186 (CHEMBL3583406)
Ki 4.0±n/a nM
Citation Ran, XZhao, YLiu, LBai, LYang, CYZhou, BMeagher, JLChinnaswamy, KStuckey, JAWang, S Structure-Based Design of¿-Carboline Analogues as Potent and Specific BET Bromodomain Inhibitors. J Med Chem58:4927-39 (2015) 
 
Bromodomain-containing protein 3
Name:Bromodomain-containing protein 3
Type:Protein
Mol. Mass.:79571.81
Organism:Homo sapiens (Human)
Description:Q15059
Residue:726
BDBM50092312
NameBDBM50092312
Synonyms:Birabresib OTX-015
TypeSmall organic molecule
Emp. Form.C25H22ClN5O2S
Mol. Mass.491.992
SMILES[H][C@@]1(CC(=O)Nc2ccc(O)cc2)N=C(c2c(C)c(C)sc2-n2c(C)nnc12)c1ccc(Cl)cc1