Reaction Details
TargetCarbonic anhydrase 1
LigandBDBM50092599
Substrate/Competitorn/a
Meas. Tech.ChEMBL_1500871 (CHEMBL3588511)
Ki>10000±n/a nM
Citation Carradori, SMollica, ACeruso, MD'Ascenzio, MDe Monte, CChimenti, PSabia, RAkdemir, ASupuran, CT New amide derivatives of Probenecid as selective inhibitors of carbonic anhydrase IX and XII: biological evaluation and molecular modelling studies. Bioorg Med Chem23:2975-81 (2015) 
 
Carbonic anhydrase 1
Name:Carbonic anhydrase 1
Type:Enzyme
Mol. Mass.:28873.37
Organism:Homo sapiens (Human)
Description:P00915
Residue:261
BDBM50092599
NameBDBM50092599
Synonyms:CHEMBL3586213
TypeSmall organic molecule
Emp. Form.C20H32N2O3S
Mol. Mass.380.545
SMILESCCCN(CCC)S(=O)(=O)c1ccc(cc1)C(=O)NC1CCC(C)CC1