Reaction Details
TargetCarbonic anhydrase 1
LigandBDBM50093554
Substrate/Competitorn/a
Meas. Tech.ChEMBL_1501463 (CHEMBL3588569)
Ki 4215±n/a nM
Citation Mojzych, MCeruso, MBielawska, ABielawski, KFornal, ESupuran, CT New pyrazolo[4,3-e][1,2,4]triazine sulfonamides as carbonic anhydrase inhibitors. Bioorg Med Chem23:3674-80 (2015) 
 
Carbonic anhydrase 1
Name:Carbonic anhydrase 1
Type:Enzyme
Mol. Mass.:28873.37
Organism:Homo sapiens (Human)
Description:P00915
Residue:261
BDBM50093554
NameBDBM50093554
Synonyms:CHEMBL3585758
TypeSmall organic molecule
Emp. Form.C23H24ClN7O3S
Mol. Mass.514
SMILESCCOc1ccc(cc1-c1nnc2n(nc(C)c2n1)-c1ccc(Cl)cc1)S(=O)(=O)N1CCNCC1