Reaction Details
TargetCarbonic anhydrase 9
LigandBDBM50093561
Substrate/Competitorn/a
Meas. Tech.ChEMBL_1501465 (CHEMBL3588571)
Ki 25±n/a nM
Citation Mojzych, MCeruso, MBielawska, ABielawski, KFornal, ESupuran, CT New pyrazolo[4,3-e][1,2,4]triazine sulfonamides as carbonic anhydrase inhibitors. Bioorg Med Chem23:3674-80 (2015) 
 
Carbonic anhydrase 9
Name:Carbonic anhydrase 9
Type:Enzyme
Mol. Mass.:49669.03
Organism:Homo sapiens (Human)
Description:Catalytic domain of human cloned isozyme was used in the assay
Residue:459
BDBM50093561
NameBDBM50093561
Synonyms:CHEMBL3585751
TypeSmall organic molecule
Emp. Form.C22H24N6O4S
Mol. Mass.468.529
SMILESCCOc1ccc(cc1-c1nnc2n(nc(C)c2n1)-c1ccc(C)cc1)S(=O)(=O)NCCO