Reaction Details
TargetCarbonic anhydrase 2
LigandBDBM50093558
Substrate/Competitorn/a
Meas. Tech.ChEMBL_1501464 (CHEMBL3588570)
Ki>50000±n/a nM
Citation Mojzych, MCeruso, MBielawska, ABielawski, KFornal, ESupuran, CT New pyrazolo[4,3-e][1,2,4]triazine sulfonamides as carbonic anhydrase inhibitors. Bioorg Med Chem23:3674-80 (2015) 
 
Carbonic anhydrase 2
Name:Carbonic anhydrase 2
Type:Enzyme
Mol. Mass.:29250.71
Organism:Homo sapiens (Human)
Description:P00918
Residue:260
BDBM50093558
NameBDBM50093558
Synonyms:CHEMBL3585754
TypeSmall organic molecule
Emp. Form.C24H28N6O3S
Mol. Mass.480.583
SMILESCCOc1ccc(cc1-c1nnc2n(nc(C)c2n1)-c1ccc(C)cc1)S(=O)(=O)N[C@@H](C)CC