Reaction Details
TargetCarbonic anhydrase 1
LigandBDBM50093561
Substrate/Competitorn/a
Meas. Tech.ChEMBL_1501463 (CHEMBL3588569)
Ki 605±n/a nM
Citation Mojzych, MCeruso, MBielawska, ABielawski, KFornal, ESupuran, CT New pyrazolo[4,3-e][1,2,4]triazine sulfonamides as carbonic anhydrase inhibitors. Bioorg Med Chem23:3674-80 (2015) 
 
Carbonic anhydrase 1
Name:Carbonic anhydrase 1
Type:Enzyme
Mol. Mass.:28873.37
Organism:Homo sapiens (Human)
Description:P00915
Residue:261
BDBM50093561
NameBDBM50093561
Synonyms:CHEMBL3585751
TypeSmall organic molecule
Emp. Form.C22H24N6O4S
Mol. Mass.468.529
SMILESCCOc1ccc(cc1-c1nnc2n(nc(C)c2n1)-c1ccc(C)cc1)S(=O)(=O)NCCO