Reaction Details
TargetAmine oxidase [flavin-containing] A
LigandBDBM50093711
Substrate/Competitorn/a
Meas. Tech.ChEMBL_1501477 (CHEMBL3586839)
IC50 16.0±n/a nM
Citation Khattab, SNHaiba, NSAsal, AMBekhit, AAAmer, AAbdel-Rahman, HMEl-Faham, A Synthesis and evaluation of quinazoline amino acid derivatives as mono amine oxidase (MAO) inhibitors. Bioorg Med Chem23:3574-85 (2015) 
 
Amine oxidase [flavin-containing] A
Name:Amine oxidase [flavin-containing] A
Type:PROTEIN
Mol. Mass.:59764.63
Organism:Bos taurus
Description:ChEMBL_1501477
Residue:527
BDBM50093711
NameBDBM50093711
Synonyms:CHEMBL3585838
TypeSmall organic molecule
Emp. Form.C17H18N4O2
Mol. Mass.310.3504
SMILESNNC(=O)CCN1C(Nc2ccccc2C1=O)c1ccccc1