Reaction Details
TargetAmine oxidase [flavin-containing] B
LigandBDBM50097438
Substrate/Competitorn/a
Meas. Tech.ChEMBL_1501478 (CHEMBL3586840)
IC50 310000±n/a nM
Citation Khattab, SNHaiba, NSAsal, AMBekhit, AAAmer, AAbdel-Rahman, HMEl-Faham, A Synthesis and evaluation of quinazoline amino acid derivatives as mono amine oxidase (MAO) inhibitors. Bioorg Med Chem23:3574-85 (2015) 
 
Amine oxidase [flavin-containing] B
Name:Amine oxidase [flavin-containing] B
Type:PROTEIN
Mol. Mass.:58428.94
Organism:Bos taurus
Description:ChEMBL_1501478
Residue:520
BDBM50097438
NameBDBM50097438
Synonyms:CHEMBL3585821
TypeSmall organic molecule
Emp. Form.C16H16N4O2
Mol. Mass.296.3238
SMILESNNC(=O)CN1C(Nc2ccccc2C1=O)c1ccccc1