Reaction Details
TargetCatenin beta-1
LigandBDBM50094486
Substrate/Competitorn/a
Meas. Tech.ChEMBL_1504364 (CHEMBL3592701)
Ki 17000±n/a nM
Citation Catrow, JLZhang, YZhang, MJi, H Discovery of Selective Small-Molecule Inhibitors for the฿-Catenin/T-Cell Factor Protein-Protein Interaction through the Optimization of the Acyl Hydrazone Moiety. J Med Chem58:4678-92 (2015) 
 
Catenin beta-1
Name:Catenin beta-1
Type:PROTEIN
Mol. Mass.:85484.08
Organism:Homo sapiens (Human)
Description:ChEMBL_1504364
Residue:781
BDBM50094486
NameBDBM50094486
Synonyms:CHEMBL3589160
TypeSmall organic molecule
Emp. Form.C13H9N9O
Mol. Mass.307.2703
SMILESC(Cn1c2ccccc2c2nc3nonc3nc12)c1nn[nH]n1