Reaction Details
TargetCatenin beta-1
LigandBDBM50094489
Substrate/Competitorn/a
Meas. Tech.ChEMBL_1504364 (CHEMBL3592701)
Ki 240000±n/a nM
Citation Catrow, JLZhang, YZhang, MJi, H Discovery of Selective Small-Molecule Inhibitors for the฿-Catenin/T-Cell Factor Protein-Protein Interaction through the Optimization of the Acyl Hydrazone Moiety. J Med Chem58:4678-92 (2015) 
 
Catenin beta-1
Name:Catenin beta-1
Type:PROTEIN
Mol. Mass.:85484.08
Organism:Homo sapiens (Human)
Description:ChEMBL_1504364
Residue:781
BDBM50094489
NameBDBM50094489
Synonyms:CHEMBL3589157
TypeSmall organic molecule
Emp. Form.C12H6N6O
Mol. Mass.250.2156
SMILESN#CCn1c2ccccc2c2nc3nonc3nc12