Reaction Details
TargetCatenin beta-1
LigandBDBM50014148
Substrate/Competitorn/a
Meas. Tech.ChEMBL_1504364 (CHEMBL3592701)
Ki 1400±n/a nM
Citation Catrow, JLZhang, YZhang, MJi, H Discovery of Selective Small-Molecule Inhibitors for the฿-Catenin/T-Cell Factor Protein-Protein Interaction through the Optimization of the Acyl Hydrazone Moiety. J Med Chem58:4678-92 (2015) 
 
Catenin beta-1
Name:Catenin beta-1
Type:PROTEIN
Mol. Mass.:85484.08
Organism:Homo sapiens (Human)
Description:ChEMBL_1504364
Residue:781
BDBM50014148
NameBDBM50014148
Synonyms:CHEMBL3260853
TypeSmall organic molecule
Emp. Form.C33H33ClN4O9
Mol. Mass.665.09
SMILESCOC(=O)[C@H](CCC(O)=O)NC(=O)[C@H](CC(O)=O)NC(=O)[C@H](Cc1ccc2ccccc2c1)NC(=O)Cc1cc2cc(Cl)ccc2[nH]1