Reaction Details
TargetCatenin beta-1
LigandBDBM50094494
Substrate/Competitorn/a
Meas. Tech.ChEMBL_1504365 (CHEMBL3592702)
Ki 4100±n/a nM
Citation Catrow, JLZhang, YZhang, MJi, H Discovery of Selective Small-Molecule Inhibitors for the฿-Catenin/T-Cell Factor Protein-Protein Interaction through the Optimization of the Acyl Hydrazone Moiety. J Med Chem58:4678-92 (2015) 
 
Catenin beta-1
Name:Catenin beta-1
Type:PROTEIN
Mol. Mass.:85484.08
Organism:Homo sapiens (Human)
Description:ChEMBL_1504364
Residue:781
BDBM50094494
NameBDBM50094494
Synonyms:CHEMBL3589022
TypeSmall organic molecule
Emp. Form.C12H7N5O3
Mol. Mass.269.2157
SMILESOC(=O)Cn1c2ccccc2c2nc3nonc3nc12