Reaction Details
TargetCatenin beta-1
LigandBDBM50094510
Substrate/Competitorn/a
Meas. Tech.ChEMBL_1504390 (CHEMBL3592843)
Ki 88000±n/a nM
Citation Catrow, JLZhang, YZhang, MJi, H Discovery of Selective Small-Molecule Inhibitors for the฿-Catenin/T-Cell Factor Protein-Protein Interaction through the Optimization of the Acyl Hydrazone Moiety. J Med Chem58:4678-92 (2015) 
 
Catenin beta-1
Name:Catenin beta-1
Type:PROTEIN
Mol. Mass.:85484.08
Organism:Homo sapiens (Human)
Description:ChEMBL_1504364
Residue:781
BDBM50094510
NameBDBM50094510
Synonyms:CHEMBL3589019
TypeSmall organic molecule
Emp. Form.C14H9N9O3
Mol. Mass.351.2798
SMILESNc1nonc1NC(=O)Cn1c2ccccc2c2nc3nonc3nc12