Reaction Details
TargetCatenin beta-1
LigandBDBM50094607
Substrate/Competitorn/a
Meas. Tech.ChEMBL_1504364 (CHEMBL3592701)
Ki 13000±n/a nM
Citation Catrow, JLZhang, YZhang, MJi, H Discovery of Selective Small-Molecule Inhibitors for the฿-Catenin/T-Cell Factor Protein-Protein Interaction through the Optimization of the Acyl Hydrazone Moiety. J Med Chem58:4678-92 (2015) 
 
Catenin beta-1
Name:Catenin beta-1
Type:PROTEIN
Mol. Mass.:85484.08
Organism:Homo sapiens (Human)
Description:ChEMBL_1504364
Residue:781
BDBM50094607
NameBDBM50094607
Synonyms:CHEMBL3589162
TypeSmall organic molecule
Emp. Form.C21H16N4O5S
Mol. Mass.436.441
SMILESOC(=O)c1cc(Nc2nc3ccccc3nc2NS(=O)(=O)c2ccccc2)ccc1O