Reaction Details
TargetOxysterols receptor LXR-alpha
LigandBDBM19992
Substrate/Competitorn/a
Meas. Tech.ChEMBL_1502320 (CHEMBL3591554)
EC50 1300±n/a nM
Citation Koura, MMatsuda, TOkuda, AWatanabe, YYamaguchi, YKurobuchi, SMatsumoto, YShibuya, K Design, synthesis and pharmacology of 1,1-bistrifluoromethylcarbinol derivatives as liver X receptorß-selective agonists. Bioorg Med Chem Lett25:2668-74 (2015) 
 
Oxysterols receptor LXR-alpha
Name:Oxysterols receptor LXR-alpha
Type:Enzyme Catalytic Domain
Mol. Mass.:50403.85
Organism:Homo sapiens (Human)
Description:Q13133
Residue:447
BDBM19992
NameBDBM19992
Synonyms:2-[3-[3-[[2-chloro-3-(trifluoromethyl)phenyl]methyl-[2,2-di(phenyl)ethyl]amino]propoxy]phenyl]acetic acid CHEMBL59030 GW3965 US10669296, Compound GW3965 | US10945978, Compound 2
TypeSmall organic molecule
Emp. Form.C33H31ClF3NO3
Mol. Mass.582.052
SMILESOC(=O)Cc1cccc(OCCCN(CC(c2ccccc2)c2ccccc2)Cc2cccc(c2Cl)C(F)(F)F)c1