Reaction Details
TargetGhrelin O-acyltransferase
LigandBDBM50094874
Substrate/Competitorn/a
Meas. Tech.ChEMBL_1502747 (CHEMBL3590857)
IC50 3800±n/a nM
Citation Zhao, FDarling, JEGibbs, RAHougland, JL A new class of ghrelin O-acyltransferase inhibitors incorporating triazole-linked lipid mimetic groups. Bioorg Med Chem Lett25:2800-3 (2015) 
 
Ghrelin O-acyltransferase
Name:Ghrelin O-acyltransferase
Type:Enzyme
Mol. Mass.:49733.10
Organism:Homo sapiens (Human)
Description:Q96T53
Residue:435
BDBM50094874
NameBDBM50094874
Synonyms:CHEMBL3589131
TypeSmall organic molecule
Emp. Form.C33H45N9O6
Mol. Mass.663.7671
SMILESCC(C)C[C@H](NC(=O)[C@H](Cc1ccccc1)NC(=O)[C@H](Cn1cc(CCc2ccccc2)nn1)NC(=O)[C@H](CO)NC(=O)CN)C(N)=O