Reaction Details
TargetPoly [ADP-ribose] polymerase tankyrase-2
LigandBDBM50094923
Substrate/Competitorn/a
Meas. Tech.ChEMBL_1502964 (CHEMBL3591898)
IC50 2200±n/a nM
Citation Kumpan, KNathubhai, AZhang, CWood, PJLloyd, MDThompson, ASHaikarainen, TLehtiö, LThreadgill, MD Structure-based design, synthesis and evaluation in vitro of arylnaphthyridinones, arylpyridopyrimidinones and their tetrahydro derivatives as inhibitors of the tankyrases. Bioorg Med Chem23:3013-32 (2015) 
 
Poly [ADP-ribose] polymerase tankyrase-2
Name:Poly [ADP-ribose] polymerase tankyrase-2
Type:Enzyme
Mol. Mass.:126937.16
Organism:Homo sapiens (Human)
Description:Q9H2K2
Residue:1166
BDBM50094923
NameBDBM50094923
Synonyms:CHEMBL3589254
TypeSmall organic molecule
Emp. Form.C14H10N2O
Mol. Mass.222.242
SMILESO=c1[nH]c(cc2ccncc12)-c1ccccc1