Reaction Details
TargetAndrogen receptor
LigandBDBM18525
Substrate/Competitorn/a
Meas. Tech.ChEMBL_1503066 (CHEMBL3592212)
Ki 160±n/a nM
Citation Ivachtchenko, AVIvanenkov, YAMitkin, ODVorobiev, AAKuznetsova, IVShevkun, NAKoryakova, AGKarapetian, RNTrifelenkov, ASKravchenko, DVVeselov, MSChufarova, NV Design, synthesis and biological evaluation of novel 5-oxo-2-thioxoimidazolidine derivatives as potent androgen receptor antagonists. Eur J Med Chem99:51-66 (2015) 
 
Androgen receptor
Name:Androgen receptor
Type:Receptor
Mol. Mass.:99185.27
Organism:Homo sapiens (Human)
Description:CHO cells were stably transfected with human AR gene.
Residue:920
BDBM18525
NameBDBM18525
Synonyms:Bicalutamide N-[4-cyano-3-(trifluoromethyl)phenyl]-3-[(4-fluorobenzene)sulfonyl]-2-hydroxy-2-methylpropanamide US20230382870, Bicalutumide US9682960, CAS
TypeSmall organic molecule
Emp. Form.C18H14F4N2O4S
Mol. Mass.430.373
SMILESCC(O)(CS(=O)(=O)c1ccc(F)cc1)C(=O)Nc1ccc(C#N)c(c1)C(F)(F)F