Reaction Details
TargetVascular endothelial growth factor receptor 2
LigandBDBM50095119
Substrate/Competitorn/a
Meas. Tech.ChEMBL_1503361 (CHEMBL3590864)
IC50 310±n/a nM
Citation Eldehna, WMFares, MIbrahim, HSAly, MHZada, SAli, MMAbou-Seri, SMAbdel-Aziz, HAAbou El Ella, DA Indoline ureas as potential anti-hepatocellular carcinoma agents targeting VEGFR-2: Synthesis, in vitro biological evaluation and molecular docking. Eur J Med Chem100:89-97 (2015) 
 
Vascular endothelial growth factor receptor 2
Name:Vascular endothelial growth factor receptor 2
Type:Receptor Tyrosine Kinase
Mol. Mass.:151510.97
Organism:Homo sapiens (Human)
Description:P35968
Residue:1356
BDBM50095119
NameBDBM50095119
Synonyms:CHEMBL3589200
TypeSmall organic molecule
Emp. Form.C21H16ClN5O4S
Mol. Mass.469.901
SMILESNS(=O)(=O)c1ccc(NC(=O)Nc2ccc(cc2)\N=C2/C(=O)Nc3ccc(Cl)cc23)cc1