Reaction Details
TargetDNA gyrase subunit A/B
LigandBDBM50226181
Substrate/Competitorn/a
Meas. Tech.ChEMBL_1503714 (CHEMBL3592385)
IC50 10.0±n/a nM
Citation Toma?ic, TKatsamakas, SHodnik, ?Ila?, JBrvar, MSolmajer, TMontalvão, STammela, PBanjanac, MErgovic, GAnderluh, MPeterlin Ma?ic, LKikelj, D Discovery of 4,5,6,7-Tetrahydrobenzo[1,2-d]thiazoles as Novel DNA Gyrase Inhibitors Targeting the ATP-Binding Site. J Med Chem58:5501-21 (2015) 
 
DNA gyrase subunit A/B
Name:DNA gyrase subunit A/B
Synonyms:DNA Gyrase
Type:A2B2 tetramer
Mol. Mass.:n/a
Description:n/a
Components:This complex has 2 components.
Component 1
Name:DNA gyrase subunit A
Type:Enzyme Subunit
Mol. Mass.:99588.82
Organism:Staphylococcus aureus
Description:n/a
Residue:889
Component 2
Name:DNA gyrase subunit B
Synonyms:DNA gyrase DNA gyrase subunit B (gyrB) gyrB
Type:Enzyme Subunit
Mol. Mass.:72530.91
Organism:Staphylococcus aureus
Description:n/a
Residue:644
BDBM50226181
NameBDBM50226181
Synonyms:(3R,4S,5R,6R)-5-hydroxy-6-(4-hydroxy-3-(4-hydroxy-3-(3-methylbut-2-enyl)benzamido)-2-oxo-2H-chromen-7-yloxy)-3-methoxy-2,2-dimethyl-tetrahydro-2H-pyran-4-yl carbamate CHEMBL36506 Carbamic acid (3R,4S,5R,6R)-5-hydroxy-6-{4-hydroxy-3-[4-hydroxy-3-(4-methyl-pent-3-enyl)-benzoylamino]-8-methyl-2-oxo-2H-chromen-7-yloxy}-3-methoxy-2,2-dimethyl-tetrahydro-pyran-4-yl ester Carbamic acid 5-hydroxy-6-{4-hydroxy-3-[4-hydroxy-3-(3-methyl-but-2-enyl)-benzoylamino]-8-methyl-2-oxo-2H-chromen-7-yloxy}-3-methoxy-2,2-dimethyl-tetrahydro-pyran-4-yl ester(Novobiocin) | NOVOBIOCIN
TypeSmall organic molecule
Emp. Form.C31H36N2O11
Mol. Mass.612.6243
SMILES[#6]-[#8]-[#6@@H]1-[#6@@H](-[#8]-[#6](-[#7])=O)-[#6@@H](-[#8])-[#6@H](-[#8]-c2ccc3c(-[#8])c(-[#7]-[#6](=O)-c4ccc(-[#8])c(-[#6]\[#6]=[#6](/[#6])-[#6])c4)c(=O)oc3c2-[#6])-[#8]C1([#6])[#6]