Reaction Details
TargetProstaglandin E2 receptor EP3 subtype
LigandBDBM50095295
Substrate/Competitorn/a
Meas. Tech.ChEMBL_1503717 (CHEMBL3592388)
Ki 3.6±n/a nM
Citation Abdel-Magid, AF Prostaglandin EP3 Receptor Antagonists May Provide Novel Treatment for Diabetes. ACS Med Chem Lett6:626-7 (2015) 
 
Prostaglandin E2 receptor EP3 subtype
Name:Prostaglandin E2 receptor EP3 subtype
Type:Enzyme
Mol. Mass.:43335.03
Organism:Homo sapiens (Human)
Description:P43115
Residue:390
BDBM50095295
NameBDBM50095295
Synonyms:CHEMBL3589083 | US9278953, 2
TypeSmall organic molecule
Emp. Form.C19H19ClN4O2
Mol. Mass.370.833
SMILESCn1ncc2c(Cl)cc(cc12)-c1ccc(c(=O)[nH]1)[C@@]1(C)CCCNC1=O