Reaction Details
TargetNuclear receptor subfamily 1 group D member 2
LigandBDBM50095836
Substrate/Competitorn/a
Meas. Tech.ChEMBL_1502200 (CHEMBL3590985)
IC50 17500±n/a nM
Citation Torrente, EParodi, CErcolani, LDe Mei, CFerrari, AScarpelli, RGrimaldi, B Synthesis and in Vitro Anticancer Activity of the First Class of Dual Inhibitors of REV-ERBß and Autophagy. J Med Chem58:5900-15 (2015) 
 
Nuclear receptor subfamily 1 group D member 2
Name:Nuclear receptor subfamily 1 group D member 2
Type:PROTEIN
Mol. Mass.:64639.08
Organism:Homo sapiens (Human)
Description:ChEMBL_1502200
Residue:579
BDBM50095836
NameBDBM50095836
Synonyms:CHEMBL3590544
TypeSmall organic molecule
Emp. Form.C24H32FN3O
Mol. Mass.397.5288
SMILESCN1CCN(Cc2cc(CNC3(CCCC3)c3ccccc3F)ccc2O)CC1