Reaction Details
TargetNuclear receptor subfamily 1 group D member 2
LigandBDBM50095837
Substrate/Competitorn/a
Meas. Tech.ChEMBL_1502200 (CHEMBL3590985)
IC50 1340±n/a nM
Citation Torrente, EParodi, CErcolani, LDe Mei, CFerrari, AScarpelli, RGrimaldi, B Synthesis and in Vitro Anticancer Activity of the First Class of Dual Inhibitors of REV-ERBß and Autophagy. J Med Chem58:5900-15 (2015) 
 
Nuclear receptor subfamily 1 group D member 2
Name:Nuclear receptor subfamily 1 group D member 2
Type:PROTEIN
Mol. Mass.:64639.08
Organism:Homo sapiens (Human)
Description:ChEMBL_1502200
Residue:579
BDBM50095837
NameBDBM50095837
Synonyms:CHEMBL3590573
TypeSmall organic molecule
Emp. Form.C25H33FN2
Mol. Mass.380.5413
SMILESCN1CCC(Cc2cccc(CNC3(CCCC3)c3ccc(F)cc3)c2)CC1