Reaction Details
TargetCannabinoid receptor 1
LigandBDBM50095949
Substrate/Competitorn/a
Meas. Tech.ChEMBL_1502797 (CHEMBL3591200)
EC50<10000±n/a nM
Citation Cawston, EEConnor, MDi Marzo, VSilvestri, RGlass, M Distinct Temporal Fingerprint for Cyclic Adenosine Monophosphate (cAMP) Signaling of Indole-2-carboxamides as Allosteric Modulators of the Cannabinoid Receptors. J Med Chem58:5979-88 (2015) 
 
Cannabinoid receptor 1
Name:Cannabinoid receptor 1
Type:G Protein-Coupled Receptor (GPCR)
Mol. Mass.:52868.96
Organism:Homo sapiens (Human)
Description:P21554
Residue:472
BDBM50095949
NameBDBM50095949
Synonyms:CHEMBL3590378
TypeSmall organic molecule
Emp. Form.C20H21ClN2O2
Mol. Mass.356.846
SMILESCCc1c([nH]c2ccc(Cl)cc12)C(=O)OCCc1ccc(NC)cc1